{"text_format":"1","workbook":"xlsx","n_sheets":4,"sheets":["FV_CASH","FV_CARD","FV_CARD (2)","data"],"not_rendered":{"charts":0,"images":0,"macros":0,"external_links":0,"defined_names":10,"comments":3,"pivot_tables":0},"unopened":[],"bounds":{"document_bytes":16777216,"sheet_cells":100000,"rows_first":2000,"rows_last":500,"rows_between":2000,"halvings":0,"cell_chars":16384,"cell_head_chars":4096},"cells_cut":0,"cells_raw":0,"read":"whole","date_system":"1900"}

{"sheet":"FV_CASH","index":0,"n_rows":123,"n_cols":27,"rows_kept":123,"cut":false,"hidden":false,"merged":[[0,0,0,8]]}
["Vyúčtovanie firemných výdavkov cash"]
[null,null,null,null,null,null,null,null,null,null,null,"CASH"]
[null,"CASH",null,{"$f":"IF(C3=\"\",\"VYPLNTE HODNOTU!\",\"\")","v":"VYPLNTE HODNOTU!"}]
[null,null,null,null,null,null,null,null,null,null,null,"DK"]
[null,"Dátum vyúčtovania:","2023-01-31",{"$f":"IF(C5=\"\",\"VYPLNTE HODNOTU!\",\"\")","v":""},null,null,null,null,null,null,null,"KK"]
[null,"Vyúčtovanie za zamestnanca:",null,{"$f":"IF(C6=\"\",\"VYPLNTE HODNOTU!\",\"\")","v":"VYPLNTE HODNOTU!"},null,null,null,null,null,null,null,{"$f":"IF($C$3=\"Debetná karta\",\"DK\",\"KK\")","v":"KK"}]
[null,"IBAN",null,{"$f":"IF(C7=\"\",\"VYPLNTE HODNOTU!\",\"\")","v":"VYPLNTE HODNOTU!"}]
[null,"Mesiac vyúčtovania:",{"$f":"IF(C5=0,\"\",MONTH(C5))","v":1}]
[null,"Rok vyúčtovania:",{"$f":"IF(C5=0,\"\",YEAR(C5))","v":2023}]
[null,"Kontrolný súčet EUR:",{"$f":"SUBTOTAL(9,$G:$G)","v":0}]
[null,"Kontrolný súčet FCY:",{"$f":"SUBTOTAL(9,$E:$E)","v":0}]
[null,null,null,null,null,null,null,null,null,null,null,"Filter na nenulove polozky"]
["Por. číslo","Dátum","Druh výdavku","Vlastný popis","Čiastka v mene dokladu","Mena","Suma v EUR","Doklad","Čestné prehlásenie",null,null,"Account","ShortName","ContraAct","Debit","Credit","FCCurrency","FCDebit","FCCredit","RefDate","TaxDate","DueDate","VatDate","ProfitCode","LineMemo","Ref1","Ref2"]
[1,null,null,null,null,null,null,"ANO",null,{"$f":"IF(H14=\"\",\"VYPLNIT HODNOTU!\",IF(H14=\"NIE\",\"DOPLNIT CESTNE PREHLASENIE\",\"\"))","v":""},null,{"$f":"IF(AND(H14=\"NIE\",I14=\"NIE\"),VLOOKUP(#REF!,data!$E:$F,2,0),IFERROR(IF(H14=data!$A$2,VLOOKUP(FV_CASH!C14,data!$Q:$R,2,0),\"\"),\"\"))","v":""},{"$f":"IF(AND(I14=\"NIE\",J14=\"NIE\"),VLOOKUP(#REF!,data!$E:$F,2,0),IFERROR(IF(I14=data!$A$2,VLOOKUP(FV_CASH!D14,data!$Q:$R,2,0),\"\"),\"\"))","v":""},null,{"$f":"IF(G14<>0,G14,\"\")","v":""},null,{"$f":"F14","v":0},null,null,null,{"$f":"V14","v":"2023-01-31"},{"$f":"IF(O14<>0,$C$5,\"\")","v":"2023-01-31"},{"$f":"U14","v":"2023-01-31"},{"$f":"VLOOKUP($C$6,data!E2:I136,5,0)","v":{"$error":"#N/A"}},{"$f":"_xlfn.CONCAT(\"FV\",\"_\",$C$6,\"_\",$C$8,\"_\",$C$9,\"_\",$L$2,\"\")","v":"FV__1_2023_CASH"},{"$f":"_xlfn.CONCAT(\"FV\",\"_\",$C$9,$C$8,\"_\",$L$2,\"\")","v":"FV_20231_CASH"},{"$f":"M69","v":""}]
[2,null,null,null,null,null,null,null,null,{"$f":"IF(H15=\"\",\"VYPLNIT HODNOTU!\",IF(H15=\"NIE\",\"DOPLNIT CESTNE PREHLASENIE\",\"\"))","v":"VYPLNIT HODNOTU!"},null,{"$f":"IF(AND(H15=\"NIE\",I15=\"NIE\"),VLOOKUP(#REF!,data!$E:$F,2,0),IFERROR(IF(H15=data!$A$2,VLOOKUP(FV_CASH!C15,data!$Q:$R,2,0),\"\"),\"\"))","v":""},null,null,{"$f":"IF(G15<>0,G15,\"\")","v":""},null,0,null,null,null,"2023-01-31","2023-01-31","2023-01-31",{"$f":"VLOOKUP($C$6,data!E3:I137,5,0)","v":{"$error":"#N/A"}},"FV__1_2023_CASH","FV_20231_CASH",""]
[3,null,null,null,null,null,null,null,null,"VYPLNIT HODNOTU!",null,{"$f":"IF(AND(H16=\"NIE\",I16=\"NIE\"),VLOOKUP(#REF!,data!$E:$F,2,0),IFERROR(IF(H16=data!$A$2,VLOOKUP(FV_CASH!C16,data!$Q:$R,2,0),\"\"),\"\"))","v":""},null,null,"",null,0,null,null,null,"2023-01-31","2023-01-31","2023-01-31",{"$f":"VLOOKUP($C$6,data!E4:I138,5,0)","v":{"$error":"#N/A"}},"FV__1_2023_CASH","FV_20231_CASH",""]
[4,null,null,null,null,null,null,null,null,"VYPLNIT HODNOTU!",null,{"$f":"IF(AND(H17=\"NIE\",I17=\"NIE\"),VLOOKUP(#REF!,data!$E:$F,2,0),IFERROR(IF(H17=data!$A$2,VLOOKUP(FV_CASH!C17,data!$Q:$R,2,0),\"\"),\"\"))","v":""},null,null,"",null,0,null,null,null,"2023-01-31","2023-01-31","2023-01-31",{"$f":"VLOOKUP($C$6,data!E5:I139,5,0)","v":{"$error":"#N/A"}},"FV__1_2023_CASH","FV_20231_CASH",""]
[5,null,null,null,null,null,null,null,null,"VYPLNIT HODNOTU!",null,{"$f":"IF(AND(H18=\"NIE\",I18=\"NIE\"),VLOOKUP(#REF!,data!$E:$F,2,0),IFERROR(IF(H18=data!$A$2,VLOOKUP(FV_CASH!C18,data!$Q:$R,2,0),\"\"),\"\"))","v":""},null,null,"",null,0,null,null,null,"2023-01-31","2023-01-31","2023-01-31",{"$f":"VLOOKUP($C$6,data!E6:I140,5,0)","v":{"$error":"#N/A"}},"FV__1_2023_CASH","FV_20231_CASH",""]
[6,null,null,null,null,null,null,null,null,"VYPLNIT HODNOTU!",null,{"$f":"IF(AND(H19=\"NIE\",I19=\"NIE\"),VLOOKUP(#REF!,data!$E:$F,2,0),IFERROR(IF(H19=data!$A$2,VLOOKUP(FV_CASH!C19,data!$Q:$R,2,0),\"\"),\"\"))","v":""},null,null,"",null,0,null,null,null,"2023-01-31","2023-01-31","2023-01-31",{"$f":"VLOOKUP($C$6,data!E7:I141,5,0)","v":{"$error":"#N/A"}},"FV__1_2023_CASH","FV_20231_CASH",""]
[7,null,null,null,null,null,null,null,null,"VYPLNIT HODNOTU!",null,{"$f":"IF(AND(H20=\"NIE\",I20=\"NIE\"),VLOOKUP(#REF!,data!$E:$F,2,0),IFERROR(IF(H20=data!$A$2,VLOOKUP(FV_CASH!C20,data!$Q:$R,2,0),\"\"),\"\"))","v":""},null,null,"",null,0,null,null,null,"2023-01-31","2023-01-31","2023-01-31",{"$f":"VLOOKUP($C$6,data!E8:I142,5,0)","v":{"$error":"#N/A"}},"FV__1_2023_CASH","FV_20231_CASH",""]
{"$rows_left_out":104}
{"sheet":"FV_CARD","index":1,"n_rows":149,"n_cols":27,"rows_kept":149,"cut":false,"hidden":false,"merged":[[0,0,0,9]]}
["Vyúčtovanie firemných výdavkov karta"]
[]
[null,null,"Karta","Debetná karta",{"$f":"IF(D3=\"\",\"VYPLNTE HODNOTU!\",\"\")","v":""}]
[null,null,null,null,null,null,null,null,null,null,null,null,"DK"]
[null,null,"Dátum vyúčtovania:","2021-04-30",{"$f":"IF(D5=\"\",\"VYPLNTE HODNOTU!\",\"\")","v":""},null,null,null,null,null,null,null,"KK"]
[null,null,"Vyúčtovanie za zamestnanca:",null,{"$f":"IF(D6=\"\",\"VYPLNTE HODNOTU!\",\"\")","v":"VYPLNTE HODNOTU!"},null,null,null,null,null,null,null,{"$f":"IF($D$3=\"Debetná karta\",\"DK\",\"KK\")","v":"DK"}]
[null,null,"Mesiac vyúčtovania:",{"$f":"IF(D5=0,\"\",MONTH(D5))","v":4}]
[null,null,"Rok vyúčtovania:",{"$f":"IF(D5=0,\"\",YEAR(D5))","v":2021}]
[null,null,"Kontrolný súčet:",{"$f":"SUBTOTAL(9,$H:$H)","v":0}]
[null,null,"Kontrolný súčet FCY:",{"$f":"SUBTOTAL(9,$F:$F)","v":0}]
[null,null,null,null,null,null,null,null,null,null,null,null,"Filter na nenulove polozky"]
["Por. číslo","Typ karty","Dátum","Druh výdavku","Vlastný popis","Čiastka v mene dokladu","Mena","Suma v EUR","Doklad","Čestné prehlásenie",null,null,"Account","ShortName","ContraAct","Debit","Credit","FCCurrency","FCDebit","FCCredit","RefDate","TaxDate","DueDate","VatDate","ProfitCode","LineMemo","Ref1"]
[1,{"$f":"IF($D$3=\"Debetná karta\",\"DK\",\"KK\")","v":"DK"},null,null,null,null,null,null,null,null,{"$f":"IF(I13=\"\",\"VYPLNIT HODNOTU!\",IF(I13=\"NIE\",\"DOPLNIT CESTNE PREHLASENIE\",\"\"))","v":"VYPLNIT HODNOTU!"},null,{"$f":"IF(AND(I13=\"NIE\",J13=\"NIE\"),VLOOKUP(#REF!,data!$E:$F,2,0),IFERROR(IF(I13=data!$A$2,VLOOKUP(FV_CARD!D13,data!$Q:$R,2,0),\"\"),\"\"))","v":""},{"$f":"IF(AND(J13=\"NIE\",K13=\"NIE\"),VLOOKUP(#REF!,data!$E:$F,2,0),IFERROR(IF(J13=data!$A$2,VLOOKUP(FV_CARD!E13,data!$Q:$R,2,0),\"\"),\"\"))","v":""},null,{"$f":"IF(H13<>0,H13,\"\")","v":""},null,{"$f":"G13","v":0},null,null,{"$f":"T13","v":"00:00:00"},{"$f":"W13","v":"2021-04-30"},{"$f":"IF(P13<>0,$D$5,\"\")","v":"2021-04-30"},{"$f":"V13","v":"2021-04-30"},{"$f":"VLOOKUP($D$6,data!E2:I136,5,0)","v":{"$error":"#N/A"}},{"$f":"_xlfn.CONCAT(\"FV\",\"_\",$D$6,\"_\",$D$7,\"_\",$D$8,\"_\",$M$6,\"\")","v":"FV__4_2021_DK"},{"$f":"_xlfn.CONCAT(\"FV\",\"_\",$D$8,$D$7,\"_\",$M$6,\"\")","v":"FV_20214_DK"}]
[2,{"$f":"IF($D$3=\"Debetná karta\",\"DK\",\"KK\")","v":"DK"},null,null,null,null,null,null,null,null,{"$f":"IF(I14=\"\",\"VYPLNIT HODNOTU!\",IF(I14=\"NIE\",\"DOPLNIT CESTNE PREHLASENIE\",\"\"))","v":"VYPLNIT HODNOTU!"},null,{"$f":"IF(AND(I14=\"NIE\",J14=\"NIE\"),VLOOKUP(#REF!,data!$E:$F,2,0),IFERROR(IF(I14=data!$A$2,VLOOKUP(FV_CARD!D14,data!$Q:$R,2,0),\"\"),\"\"))","v":""},null,null,{"$f":"IF(H14<>0,H14,\"\")","v":""},null,0,null,null,{"$f":"T14","v":"00:00:00"},"2021-04-30","2021-04-30","2021-04-30",{"$f":"VLOOKUP($D$6,data!E3:I137,5,0)","v":{"$error":"#N/A"}},{"$f":"_xlfn.CONCAT(\"FV\",\"_\",$D$6,\"_\",$D$7,\"_\",$D$8,\"_\",$M$6,\"\")","v":"FV__4_2021_DK"},{"$f":"_xlfn.CONCAT(\"FV\",\"_\",$D$8,$D$7,\"_\",$M$6,\"\")","v":"FV_20214_DK"}]
[3,"DK",null,null,null,null,null,null,null,null,"VYPLNIT HODNOTU!",null,{"$f":"IF(AND(I15=\"NIE\",J15=\"NIE\"),VLOOKUP(#REF!,data!$E:$F,2,0),IFERROR(IF(I15=data!$A$2,VLOOKUP(FV_CARD!D15,data!$Q:$R,2,0),\"\"),\"\"))","v":""},null,null,"",null,0,null,null,"00:00:00","2021-04-30","2021-04-30","2021-04-30",{"$f":"VLOOKUP($D$6,data!E4:I138,5,0)","v":{"$error":"#N/A"}},"FV__4_2021_DK",{"$f":"_xlfn.CONCAT(\"FV\",\"_\",$D$8,$D$7,\"_\",$M$6,\"\")","v":"FV_20214_DK"}]
[4,"DK",null,null,null,null,null,null,null,null,"VYPLNIT HODNOTU!",null,{"$f":"IF(AND(I16=\"NIE\",J16=\"NIE\"),VLOOKUP(#REF!,data!$E:$F,2,0),IFERROR(IF(I16=data!$A$2,VLOOKUP(FV_CARD!D16,data!$Q:$R,2,0),\"\"),\"\"))","v":""},null,null,"",null,0,null,null,"00:00:00","2021-04-30","2021-04-30","2021-04-30",{"$f":"VLOOKUP($D$6,data!E5:I139,5,0)","v":{"$error":"#N/A"}},"FV__4_2021_DK","FV_20214_DK"]
[5,"DK",null,null,null,null,null,null,null,null,"VYPLNIT HODNOTU!",null,{"$f":"IF(AND(I17=\"NIE\",J17=\"NIE\"),VLOOKUP(#REF!,data!$E:$F,2,0),IFERROR(IF(I17=data!$A$2,VLOOKUP(FV_CARD!D17,data!$Q:$R,2,0),\"\"),\"\"))","v":""},null,null,"",null,0,null,null,"00:00:00","2021-04-30","2021-04-30","2021-04-30",{"$f":"VLOOKUP($D$6,data!E6:I140,5,0)","v":{"$error":"#N/A"}},"FV__4_2021_DK","FV_20214_DK"]
[6,"DK",null,null,null,null,null,null,null,null,"VYPLNIT HODNOTU!",null,{"$f":"IF(AND(I18=\"NIE\",J18=\"NIE\"),VLOOKUP(#REF!,data!$E:$F,2,0),IFERROR(IF(I18=data!$A$2,VLOOKUP(FV_CARD!D18,data!$Q:$R,2,0),\"\"),\"\"))","v":""},null,null,"",null,0,null,null,"00:00:00","2021-04-30","2021-04-30","2021-04-30",{"$f":"VLOOKUP($D$6,data!E7:I141,5,0)","v":{"$error":"#N/A"}},"FV__4_2021_DK","FV_20214_DK"]
[7,"DK",null,null,null,null,null,null,null,null,"VYPLNIT HODNOTU!",null,{"$f":"IF(AND(I19=\"NIE\",J19=\"NIE\"),VLOOKUP(#REF!,data!$E:$F,2,0),IFERROR(IF(I19=data!$A$2,VLOOKUP(FV_CARD!D19,data!$Q:$R,2,0),\"\"),\"\"))","v":""},null,null,"",null,0,null,null,"00:00:00","2021-04-30","2021-04-30","2021-04-30",{"$f":"VLOOKUP($D$6,data!E8:I142,5,0)","v":{"$error":"#N/A"}},"FV__4_2021_DK","FV_20214_DK"]
[8,"DK",null,null,null,null,null,null,null,null,"VYPLNIT HODNOTU!",null,{"$f":"IF(AND(I20=\"NIE\",J20=\"NIE\"),VLOOKUP(#REF!,data!$E:$F,2,0),IFERROR(IF(I20=data!$A$2,VLOOKUP(FV_CARD!D20,data!$Q:$R,2,0),\"\"),\"\"))","v":""},null,null,"",null,0,null,null,"00:00:00","2021-04-30","2021-04-30","2021-04-30",{"$f":"VLOOKUP($D$6,data!E9:I143,5,0)","v":{"$error":"#N/A"}},"FV__4_2021_DK","FV_20214_DK"]
{"$rows_left_out":130}
{"sheet":"FV_CARD (2)","index":2,"n_rows":149,"n_cols":27,"rows_kept":149,"cut":false,"hidden":false,"merged":[[0,0,0,9]]}
["Vyúčtovanie firemných výdavkov karta"]
[]
[null,null,"Karta","Kreditná karta",{"$f":"IF(D3=\"\",\"VYPLNTE HODNOTU!\",\"\")","v":""}]
[null,null,null,null,null,null,null,null,null,null,null,null,"DK"]
[null,null,"Dátum vyúčtovania:","2021-04-30",{"$f":"IF(D5=\"\",\"VYPLNTE HODNOTU!\",\"\")","v":""},null,null,null,null,null,null,null,"KK"]
[null,null,"Vyúčtovanie za zamestnanca:",null,{"$f":"IF(D6=\"\",\"VYPLNTE HODNOTU!\",\"\")","v":"VYPLNTE HODNOTU!"},null,null,null,null,null,null,null,{"$f":"IF($D$3=\"Debetná karta\",\"DK\",\"KK\")","v":"KK"}]
[null,null,"Mesiac vyúčtovania:",{"$f":"IF(D5=0,\"\",MONTH(D5))","v":4}]
[null,null,"Rok vyúčtovania:",{"$f":"IF(D5=0,\"\",YEAR(D5))","v":2021}]
[null,null,"Kontrolný súčet:",{"$f":"SUBTOTAL(9,$H:$H)","v":0}]
[null,null,"Kontrolný súčet FCY:",{"$f":"SUBTOTAL(9,$F:$F)","v":0}]
[null,null,null,null,null,null,null,null,null,null,null,null,"Filter na nenulove polozky"]
["Por. číslo","Typ karty","Dátum","Druh výdavku","Vlastný popis","Čiastka v mene dokladu","Mena","Suma v EUR","Doklad","Čestné prehlásenie",null,null,"Account","ShortName","ContraAct","Debit","Credit","FCCurrency","FCDebit","FCCredit","RefDate","TaxDate","DueDate","VatDate","ProfitCode","LineMemo","Ref1"]
[1,{"$f":"IF($D$3=\"Debetná karta\",\"DK\",\"KK\")","v":"KK"},null,null,null,null,null,null,null,null,{"$f":"IF(I13=\"\",\"VYPLNIT HODNOTU!\",IF(I13=\"NIE\",\"DOPLNIT CESTNE PREHLASENIE\",\"\"))","v":"VYPLNIT HODNOTU!"},null,{"$f":"IF(AND(I13=\"NIE\",J13=\"NIE\"),VLOOKUP(#REF!,data!$E:$F,2,0),IFERROR(IF(I13=data!$A$2,VLOOKUP('FV_CARD (2)'!D13,data!$Q:$R,2,0),\"\"),\"\"))","v":""},{"$f":"IF(AND(J13=\"NIE\",K13=\"NIE\"),VLOOKUP(#REF!,data!$E:$F,2,0),IFERROR(IF(J13=data!$A$2,VLOOKUP('FV_CARD (2)'!E13,data!$Q:$R,2,0),\"\"),\"\"))","v":""},null,{"$f":"IF(H13<>0,H13,\"\")","v":""},null,{"$f":"G13","v":0},null,null,{"$f":"T13","v":"00:00:00"},{"$f":"W13","v":"2021-04-30"},{"$f":"IF(P13<>0,$D$5,\"\")","v":"2021-04-30"},{"$f":"V13","v":"2021-04-30"},{"$f":"VLOOKUP($D$6,data!E2:I136,5,0)","v":{"$error":"#N/A"}},{"$f":"_xlfn.CONCAT(\"FV\",\"_\",$D$6,\"_\",$D$7,\"_\",$D$8,\"_\",$M$6,\"\")","v":"FV__4_2021_KK"},{"$f":"_xlfn.CONCAT(\"FV\",\"_\",$D$8,$D$7,\"_\",$M$6,\"\")","v":"FV_20214_KK"}]
[2,{"$f":"IF($D$3=\"Debetná karta\",\"DK\",\"KK\")","v":"KK"},null,null,null,null,null,null,null,null,{"$f":"IF(I14=\"\",\"VYPLNIT HODNOTU!\",IF(I14=\"NIE\",\"DOPLNIT CESTNE PREHLASENIE\",\"\"))","v":"VYPLNIT HODNOTU!"},null,{"$f":"IF(AND(I14=\"NIE\",J14=\"NIE\"),VLOOKUP(#REF!,data!$E:$F,2,0),IFERROR(IF(I14=data!$A$2,VLOOKUP('FV_CARD (2)'!D14,data!$Q:$R,2,0),\"\"),\"\"))","v":""},null,null,{"$f":"IF(H14<>0,H14,\"\")","v":""},null,0,null,null,{"$f":"T14","v":"00:00:00"},"2021-04-30","2021-04-30","2021-04-30",{"$f":"VLOOKUP($D$6,data!E3:I137,5,0)","v":{"$error":"#N/A"}},{"$f":"_xlfn.CONCAT(\"FV\",\"_\",$D$6,\"_\",$D$7,\"_\",$D$8,\"_\",$M$6,\"\")","v":"FV__4_2021_KK"},{"$f":"_xlfn.CONCAT(\"FV\",\"_\",$D$8,$D$7,\"_\",$M$6,\"\")","v":"FV_20214_KK"}]
[3,"KK",null,null,null,null,null,null,null,null,"VYPLNIT HODNOTU!",null,{"$f":"IF(AND(I15=\"NIE\",J15=\"NIE\"),VLOOKUP(#REF!,data!$E:$F,2,0),IFERROR(IF(I15=data!$A$2,VLOOKUP('FV_CARD (2)'!D15,data!$Q:$R,2,0),\"\"),\"\"))","v":""},null,null,"",null,0,null,null,"00:00:00","2021-04-30","2021-04-30","2021-04-30",{"$f":"VLOOKUP($D$6,data!E4:I138,5,0)","v":{"$error":"#N/A"}},"FV__4_2021_KK",{"$f":"_xlfn.CONCAT(\"FV\",\"_\",$D$8,$D$7,\"_\",$M$6,\"\")","v":"FV_20214_KK"}]
[4,"KK",null,null,null,null,null,null,null,null,"VYPLNIT HODNOTU!",null,{"$f":"IF(AND(I16=\"NIE\",J16=\"NIE\"),VLOOKUP(#REF!,data!$E:$F,2,0),IFERROR(IF(I16=data!$A$2,VLOOKUP('FV_CARD (2)'!D16,data!$Q:$R,2,0),\"\"),\"\"))","v":""},null,null,"",null,0,null,null,"00:00:00","2021-04-30","2021-04-30","2021-04-30",{"$f":"VLOOKUP($D$6,data!E5:I139,5,0)","v":{"$error":"#N/A"}},"FV__4_2021_KK","FV_20214_KK"]
[5,"KK",null,null,null,null,null,null,null,null,"VYPLNIT HODNOTU!",null,{"$f":"IF(AND(I17=\"NIE\",J17=\"NIE\"),VLOOKUP(#REF!,data!$E:$F,2,0),IFERROR(IF(I17=data!$A$2,VLOOKUP('FV_CARD (2)'!D17,data!$Q:$R,2,0),\"\"),\"\"))","v":""},null,null,"",null,0,null,null,"00:00:00","2021-04-30","2021-04-30","2021-04-30",{"$f":"VLOOKUP($D$6,data!E6:I140,5,0)","v":{"$error":"#N/A"}},"FV__4_2021_KK","FV_20214_KK"]
[6,"KK",null,null,null,null,null,null,null,null,"VYPLNIT HODNOTU!",null,{"$f":"IF(AND(I18=\"NIE\",J18=\"NIE\"),VLOOKUP(#REF!,data!$E:$F,2,0),IFERROR(IF(I18=data!$A$2,VLOOKUP('FV_CARD (2)'!D18,data!$Q:$R,2,0),\"\"),\"\"))","v":""},null,null,"",null,0,null,null,"00:00:00","2021-04-30","2021-04-30","2021-04-30",{"$f":"VLOOKUP($D$6,data!E7:I141,5,0)","v":{"$error":"#N/A"}},"FV__4_2021_KK","FV_20214_KK"]
[7,"KK",null,null,null,null,null,null,null,null,"VYPLNIT HODNOTU!",null,{"$f":"IF(AND(I19=\"NIE\",J19=\"NIE\"),VLOOKUP(#REF!,data!$E:$F,2,0),IFERROR(IF(I19=data!$A$2,VLOOKUP('FV_CARD (2)'!D19,data!$Q:$R,2,0),\"\"),\"\"))","v":""},null,null,"",null,0,null,null,"00:00:00","2021-04-30","2021-04-30","2021-04-30",{"$f":"VLOOKUP($D$6,data!E8:I142,5,0)","v":{"$error":"#N/A"}},"FV__4_2021_KK","FV_20214_KK"]
[8,"KK",null,null,null,null,null,null,null,null,"VYPLNIT HODNOTU!",null,{"$f":"IF(AND(I20=\"NIE\",J20=\"NIE\"),VLOOKUP(#REF!,data!$E:$F,2,0),IFERROR(IF(I20=data!$A$2,VLOOKUP('FV_CARD (2)'!D20,data!$Q:$R,2,0),\"\"),\"\"))","v":""},null,null,"",null,0,null,null,"00:00:00","2021-04-30","2021-04-30","2021-04-30",{"$f":"VLOOKUP($D$6,data!E9:I143,5,0)","v":{"$error":"#N/A"}},"FV__4_2021_KK","FV_20214_KK"]
{"$rows_left_out":130}
{"sheet":"data","index":3,"n_rows":150,"n_cols":19,"rows_kept":150,"cut":false,"hidden":true,"merged":[]}
["DOKLAD",null,"MONTH",null,"Full name","BP Code - NEW","Account","nazov uctu","ProfitCode",null,null,null,null,null,"CCY",null,"VYDAVKY","ucet","nazov"]
["ANO",null,1,null,"Ácsová Timea",90400001,30500100,"EMPLOYEE RECEIVABLES MCY","COOP03",null,null,null,null,null,"EUR",null,"Taxi / Cestovné",55600102,"Cestovné náhrady,letenky,ubytovanie,taxi"]
["NIE",null,{"$f":"C2+1","v":2},null,"Alexandra Sulíková",90400104,30500100,"EMPLOYEE RECEIVABLES MCY",null,null,null,null,null,null,"CZK",null,"Parkovné",55600105,"Parkovné"]
[null,null,{"$f":"C3+1","v":3},null,"Alt Rainer Norbert",90400002,30500100,"EMPLOYEE RECEIVABLES MCY","CIIA01",null,null,null,null,null,"BRL",null,"Ubytovanie",55600102,"Cestovné náhrady,letenky,ubytovanie,taxi"]
[null,null,4,null,"Balážová Zuzana, Mgr.",90400137,30500100,"EMPLOYEE RECEIVABLES MCY",null,null,null,null,null,null,"CAD",null,"Repre",55600104,"Reprezentačné"]
[null,null,5,null,"Balogh Štefan , Bc.",90400133,30500100,"EMPLOYEE RECEIVABLES MCY",null,null,null,null,null,null,"CNY",null,"Diaľničná známka",59900104,"Správne poplatky"]
[null,null,6,null,"Bayoumi Zdenka, Bc.",90400130,30500100,"EMPLOYEE RECEIVABLES MCY",null,null,null,null,null,null,"BGN",null,"Spotreba materiálu",55300100,"Spotreba materiálu"]
[null,null,7,null,"Bezák Martin",90400004,30500100,"EMPLOYEE RECEIVABLES MCY","CTIT02",null,null,null,null,null,"DKK",null,"Tankovanie",55600100,"Spotreba PHM - vsetky auta"]
[null,null,8,null,"Brandysová Ivana, Bc.",90400138,30500100,"EMPLOYEE RECEIVABLES MCY",null,null,null,null,null,null,"GBP",null,"Poštovné",55400100,"Poštovné"]
[null,null,9,null,"Břenek Michal",90400005,30500100,"EMPLOYEE RECEIVABLES MCY","COSS01",null,null,null,null,null,"HKD",null,"Umývanie auta",55600101,"Opravy a udržiavanie"]
[null,null,10,null,"Bystroň Adam",90400142,30500100,"EMPLOYEE RECEIVABLES MCY",null,null,null,null,null,null,"HRK",null,"Servis auta",55600101,"Opravy a udržiavanie"]
[null,null,11,null,"Cehláriková Záleská Alena",90400007,30500100,"EMPLOYEE RECEIVABLES MCY","COMA01",null,null,null,null,null,"HUF",null,"Školenia, semináre",55900101,"Školenia zamestnancov a semináre"]
[null,null,12,null,"Cilková Lada",90400009,30500100,"EMPLOYEE RECEIVABLES MCY","COSS01",null,null,null,null,null,"CHF",null,"Literatúra, časopisy",55000107,"Odborná literatúra"]
[null,null,null,null,"Cinokur Renáta",90400010,30500100,"EMPLOYEE RECEIVABLES MCY","COOP03",null,null,null,null,null,"IDR",null,"Prenájom vozidla",55600103,"Prenájom, podnájom autá"]
["Typ karty",null,null,null,"Csiba Tomáš",90400147,30500100,"EMPLOYEE RECEIVABLES MCY","COMA01",null,null,null,null,null,"ILS",null,"Notárske služby",55500104,"Notárske služby"]
["Kreditná karta",null,null,null,"Čech Michal",90400126,30500100,"EMPLOYEE RECEIVABLES MCY",null,null,null,null,null,null,"INR",null,"Právne poradenstvo",55500100,"Právne služby"]
["Debetná karta",null,null,null,"Čuňočka Ján",90210112,30500100,"EMPLOYEE RECEIVABLES MCY","CESA01",null,null,null,null,null,"JPY",null,"Poplatok za výber z ATM",54210101,"Bankové poplatky SK"]
["CASH",null,null,null,"Daniela Flórová",90400151,30500100,"EMPLOYEE RECEIVABLES MCY","COOP08",null,null,null,null,null,"KRW",null,"Poplatok za vedenie karty",54210101,"Bankové poplatky SK"]
["Áno",null,null,null,"Danišová Andrea",90400011,30500100,"EMPLOYEE RECEIVABLES MCY","COOP05",null,null,null,null,null,"MXN",null,"Adobe SW licencia",35100101,"DODAVATELIA SALDO"]
["Nie",null,null,null,"Daňová Karin",90400012,30500100,"EMPLOYEE RECEIVABLES MCY","COMA01",null,null,null,null,null,"MYR",null,"Internetová aplikácia",55400101,"Telekomun. a internet. služby"]
{"$rows_left_out":130}